{"text_format":"1","workbook":"xlsx","n_sheets":5,"sheets":["eplustbl","Resultats PMV","Synth & graphe PMV","Resultats PPD","Tableau BREEAM"],"not_rendered":{"charts":5,"images":0,"macros":1,"external_links":0,"defined_names":0,"comments":0,"pivot_tables":0},"unopened":[],"bounds":{"document_bytes":16777216,"sheet_cells":100000,"rows_first":2000,"rows_last":500,"rows_between":2000,"halvings":0,"cell_chars":16384,"cell_head_chars":4096},"cells_cut":0,"cells_raw":0,"read":"whole","date_system":"1900"}

{"sheet":"eplustbl","index":0,"n_rows":804,"n_cols":34,"rows_kept":804,"cut":false,"hidden":false,"merged":[]}
["Program Version:","EnergyPlus"," Version 8.9.0-40101eaafd"," YMD=2021.05.17 08:59"]
["Tabular Output Report in Format: ","Comma"]
[]
["Building:","Building"]
["Environment:","SITE (O1-O1:31-12) ** Gerona - ESP SWEC WMO#=081840"]
[]
["----------------------------------------------------------------------------------------------------"]
["REPORT:","Annual Building Utility Performance Summary"]
["FOR:","Entire Facility"]
["Values gathered over      8760.00 hours"]
[]
["Site and Source Energy"]
[]
[null,null,"Total Energy [kWh]","Energy Per Total Building Area [kWh/m2]","Energy Per Conditioned Building Area [kWh/m2]"]
[null,"Total Site Energy",9700.5499999999993,59.68,59.68]
{"$rows_left_out":790}
{"sheet":"Resultats PMV","index":1,"n_rows":200,"n_cols":50,"rows_kept":200,"cut":false,"hidden":false,"merged":[[4,5,4,14],[4,22,4,31],[4,39,4,48],[0,4,0,14],[1,4,1,14]]}
[null,"1ère colonne",3,null,"Il s'agit du numéro de l'entête de colonne du tableau ZONE THERMAL COMFORT FANGER MODEL PMV qui correspond à la valeur minimale de PMV. Par défaut la colonne de PMV min à -1 est \"3 [hr]\". Le numéro est la valeur n de l'entête de colonne \"n [hr]\". Saisissez 0 pour partir de la colonne \"- [hr]\"."]
[null,"Dernière colonne",10,null,"Le numéro de la dernière colonne à reporter ci-dessous. Le numéro de l'entête de colonne est le chiffre n dans l'intitulé de ZONE THERMAL COMFORT FANGER MODEL PMV : n [hr]. Saisissez \"-\" pour la colonne \"equal to or more than\".\nAttention les tableaux ci-dessous ne sont pas automatiquement adaptés au nombre de tranches souhaitées, il faut les dimensionner manuellement et modifier la macro !! Conserver 8 tranches uniquement si vous ne voulez pas modifier la macro (dernière colonne - 1ère +1 = 8)."]
[]
[]
[null,null,null,null,null,"Totaux",null,null,null,null,null,null,null,null,null,"Total annuel",null,null,null,null,null,null,"Totaux",null,null,null,null,null,null,null,null,null,"Total annuel",null,null,null,null,null,null,"Totaux",null,null,null,null,null,null,null,null,null,"Total annuel"]
["Année",null,null,null,null,{"$f":"SUM(F9:F502)","v":1475.5},{"$f":"SUM(G9:G502)","v":1098},1130.5,1040.5,937,740.5,691.5,630.5,635.5,4148.5,{"$f":"SUM(F6:O6)","v":12528},null,"Eté",null,null,null,null,{"$f":"SUM(W9:W502)","v":60},{"$f":"SUM(X9:X502)","v":45},69,87,154,186,257,331.5,398,3644.5,{"$f":"SUM(W6:AF6)","v":5232},null,"Hiver",null,null,null,null,{"$f":"SUM(AN9:AN502)","v":1415.5},{"$f":"SUM(AO9:AO502)","v":1053},1061.5,953.5,783,554.5,434.5,299,237.5,504,{"$f":"SUM(AN6:AW6)","v":7296}]
[null,null,null,null,null,"Inférieur à","-1.000<=","-0.750<=","-0.500<=","-0.250<=","0.0000<=","0.2500<=","0.5000<=","0.7500<=","Supérieur à",null,null,null,null,null,null,null,"Inférieur à","-1.000<=","-0.750<=","-0.500<=","-0.250<=","0.0000<=","0.2500<=","0.5000<=","0.7500<=","Supérieur à",null,null,null,null,null,null,null,"Inférieur à","-1.000<=","-0.750<=","-0.500<=","-0.250<=","0.0000<=","0.2500<=","0.5000<=","0.7500<=","Supérieur à"]
["Nom Zone","Moyenne","Ecart Type","Min","Max","-1.000>","-0.750>","-0.500>","-0.250>","0.0000>","0.2500>","0.5000>","0.7500>","1.0000>","1.0000<=",null,null,"Nom Zone","Moyenne","Ecart Type","Min","Max","-1.000>","-0.750>","-0.500>","-0.250>","0.0000>","0.2500>","0.5000>","0.7500>","1.0000>","1.0000<=",null,null,"Nom Zone","Moyenne","Ecart Type","Min","Max","-1.000>","-0.750>","-0.500>","-0.250>","0.0000>","0.2500>","0.5000>","0.7500>","1.0000>","1.0000<="]
["FLOOR0:ZONE1",0.51,1.26,-2.2000000000000002,4.3899999999999997,318.5,202,252.5,256,231.5,206.5,219,197,162,1087,{"$f":"SUM(F9:O9)","v":3132},null,"FLOOR0:ZONE1",0,0,-10,1.5,15.5,10.5,16.5,23.5,38,47,61,83.5,97.5,915,{"$f":"SUM(W9:AF9)","v":1308},null,"FLOOR0:ZONE1",0,0,-10,1.5,303,191.5,236,232.5,193.5,159.5,158,113.5,64.5,172,{"$f":"SUM(AN9:AW9)","v":1824}]
["FLOOR0:ZONE2",0.34,1.28,-2.2999999999999998,3.77,449,285.5,269.5,260,240,184.5,136,147,167.5,993,{"$f":"SUM(F10:O10)","v":3132},null,"FLOOR0:ZONE2",0,0,-10,1.5,16.5,10,16,28.5,37.5,38.5,57,102.5,103.5,898,{"$f":"SUM(W10:AF10)","v":1308},null,"FLOOR0:ZONE2",0,0,-10,1.5,432.5,275.5,253.5,231.5,202.5,146,79,44.5,64,95,{"$f":"SUM(AN10:AW10)","v":1824}]
["FLOOR1:SANITAIRES",0.43,1.23,-2,3.67,317.5,293.5,316,267,236.5,178.5,165.5,148.5,145,1064,3132,null,"FLOOR1:SANITAIRES",0,0,-10,1.5,11,13.5,18.5,14.5,33.5,50,68.5,67.5,90.5,940.5,1308,null,"FLOOR1:SANITAIRES",0,0,-10,1.5,306.5,280,297.5,252.5,203,128.5,97,81,54.5,123.5,1824]
["FLOOR1:ZONE1",0.35,1.23,-2.2000000000000002,3.91,390.5,317,292.5,257.5,229,171,171,138,161,1004.5,3132,null,"FLOOR1:ZONE1",0,0,-10,1.5,17,11,18,20.5,45,50.5,70.5,78,106.5,891,1308,null,"FLOOR1:ZONE1",0,0,-10,1.5,373.5,306,274.5,237,184,120.5,100.5,60,54.5,113.5,1824]
[null,null,null,null,null,null,null,null,null,null,null,null,null,null,null,0,null,null,null,null,null,null,null,null,null,null,null,null,null,null,null,null,0,null,null,null,null,null,null,null,null,null,null,null,null,null,null,null,null,0]
[null,null,null,null,null,null,null,null,null,null,null,null,null,null,null,0,null,null,null,null,null,null,null,null,null,null,null,null,null,null,null,null,0,null,null,null,null,null,null,null,null,null,null,null,null,null,null,null,null,0]
[null,null,null,null,null,null,null,null,null,null,null,null,null,null,null,0,null,null,null,null,null,null,null,null,null,null,null,null,null,null,null,null,0,null,null,null,null,null,null,null,null,null,null,null,null,null,null,null,null,0]
{"$rows_left_out":186}
{"sheet":"Synth & graphe PMV","index":2,"n_rows":104,"n_cols":39,"rows_kept":104,"cut":false,"hidden":false,"merged":[]}
[null,"Cumul des heures par tranches de PMV et par saison"]
[null,"Saison",{"$f":"LEFT('Resultats PMV'!F8,5)&\"<\"","v":"-1.00<"},{"$f":"LEFT('Resultats PMV'!G8,5)&\"<\"","v":"-0.75<"},{"$f":"LEFT('Resultats PMV'!H8,5)&\"<\"","v":"-0.50<"},{"$f":"LEFT('Resultats PMV'!I8,5)&\"<\"","v":"-0.25<"},{"$f":"LEFT('Resultats PMV'!J8,5)&\"<\"","v":"0.000<"},{"$f":"LEFT('Resultats PMV'!K8,5)&\"<\"","v":"0.250<"},{"$f":"LEFT('Resultats PMV'!L8,5)&\"<\"","v":"0.500<"},{"$f":"LEFT('Resultats PMV'!M8,5)&\"<\"","v":"0.750<"},{"$f":"LEFT('Resultats PMV'!N8,5)&\"<\"","v":"1.000<"},{"$f":"\">=\"&LEFT('Resultats PMV'!O8,5)","v":">=1.000"}]
[null,"Eté",{"$f":"'Resultats PMV'!W6","v":60},{"$f":"'Resultats PMV'!X6","v":45},{"$f":"'Resultats PMV'!Y6","v":69},{"$f":"'Resultats PMV'!Z6","v":87},{"$f":"'Resultats PMV'!AA6","v":154},{"$f":"'Resultats PMV'!AB6","v":186},{"$f":"'Resultats PMV'!AC6","v":257},{"$f":"'Resultats PMV'!AD6","v":331.5},{"$f":"'Resultats PMV'!AE6","v":398},{"$f":"'Resultats PMV'!AF6","v":3644.5}]
[null,"Hiver",{"$f":"'Resultats PMV'!AN6","v":1415.5},{"$f":"'Resultats PMV'!AO6","v":1053},{"$f":"'Resultats PMV'!AP6","v":1061.5},{"$f":"'Resultats PMV'!AQ6","v":953.5},{"$f":"'Resultats PMV'!AR6","v":783},{"$f":"'Resultats PMV'!AS6","v":554.5},{"$f":"'Resultats PMV'!AT6","v":434.5},{"$f":"'Resultats PMV'!AU6","v":299},{"$f":"'Resultats PMV'!AV6","v":237.5},{"$f":"'Resultats PMV'!AW6","v":504}]
[null,"Année",{"$f":"SUM(C3:C4)","v":1475.5},1098,1130.5,1040.5,937,740.5,691.5,630.5,635.5,4148.5]
[]
[null,"Pourcentage du temps par tranches de PMV et par saison"]
[null,"Saison",{"$f":"C2","v":"-1.00<"},{"$f":"D2","v":"-0.75<"},"-0.50<","-0.25<","0.000<","0.250<","0.500<","0.750<","1.000<",">=1.000"]
[null,"Eté",{"$f":"C3/'Resultats PMV'!$AG$6","v":1.1467889908256881E-2},{"$f":"D3/'Resultats PMV'!$AG$6","v":8.600917431192661E-3},{"$f":"E3/'Resultats PMV'!$AG$6","v":1.3188073394495414E-2},{"$f":"F3/'Resultats PMV'!$AG$6","v":1.6628440366972478E-2},{"$f":"G3/'Resultats PMV'!$AG$6","v":2.9434250764525993E-2},{"$f":"H3/'Resultats PMV'!$AG$6","v":3.5550458715596332E-2},{"$f":"I3/'Resultats PMV'!$AG$6","v":4.9120795107033641E-2},{"$f":"J3/'Resultats PMV'!$AG$6","v":6.3360091743119268E-2},{"$f":"K3/'Resultats PMV'!$AG$6","v":7.6070336391437315E-2},{"$f":"L3/'Resultats PMV'!$AG$6","v":0.69657874617737003}]
[null,"Hiver",{"$f":"C4/'Resultats PMV'!$AX$6","v":0.19401041666666666},{"$f":"D4/'Resultats PMV'!$AX$6","v":0.14432565789473684},{"$f":"E4/'Resultats PMV'!$AX$6","v":0.1454906798245614},{"$f":"F4/'Resultats PMV'!$AX$6","v":0.13068804824561403},{"$f":"G4/'Resultats PMV'!$AX$6","v":0.10731907894736842},{"$f":"H4/'Resultats PMV'!$AX$6","v":7.600054824561403E-2},{"$f":"I4/'Resultats PMV'!$AX$6","v":5.9553179824561403E-2},{"$f":"J4/'Resultats PMV'!$AX$6","v":4.0981359649122806E-2},{"$f":"K4/'Resultats PMV'!$AX$6","v":3.2552083333333336E-2},{"$f":"L4/'Resultats PMV'!$AX$6","v":6.9078947368421059E-2}]
[null,"Année",{"$f":"C5/'Resultats PMV'!$P$6","v":0.11777618135376756},{"$f":"D5/'Resultats PMV'!$P$6","v":8.7643678160919544E-2},{"$f":"E5/'Resultats PMV'!$P$6","v":9.0237867177522343E-2},{"$f":"F5/'Resultats PMV'!$P$6","v":8.3053959131545341E-2},{"$f":"G5/'Resultats PMV'!$P$6","v":7.4792464878671777E-2},{"$f":"H5/'Resultats PMV'!$P$6","v":5.9107598978288635E-2},{"$f":"I5/'Resultats PMV'!$P$6","v":5.5196360153256706E-2},{"$f":"J5/'Resultats PMV'!$P$6","v":5.0327266922094507E-2},{"$f":"K5/'Resultats PMV'!$P$6","v":5.0726372924648787E-2},{"$f":"L5/'Resultats PMV'!$P$6","v":0.33113825031928479}]
[]
[]
[]
[]
{"$rows_left_out":90}
{"sheet":"Resultats PPD","index":3,"n_rows":53,"n_cols":15,"rows_kept":53,"cut":false,"hidden":false,"merged":[[0,4,0,14],[1,4,1,14]]}
[null,"1ère colonne",1,null,"Il s'agit du numéro de l'entête de colonne du tableau ZONE THERMAL COMFORT FANGER MODEL PPD qui correspond à la valeur minimale de PPD. Par défaut la colonne de PPD min à 5%  est \"1 [hr]\". Le numéro est la valeur n de l'entête de colonne \"n [hr]\". Saisissez 0 pour partir de la colonne \"- [hr]\"."]
[null,"Dernière colonne",7,null,"Le numéro de la dernière colonne à reporter ci-dessous. Le numéro de l'entête de colonne est le chiffre n dans l'intitulé de ZONE THERMAL COMFORT FANGER MODEL PPD : n [hr]. Saisissez \"-\" pour la colonne \"equal to or more than\".\nAttention le tableau ci-dessous n'est pas automatiquement adapté au nombre de tranches souhaitées, il faut le dimensionner manuellement et modifier la macro (nettoyage des valeurs du tableau jusqu'à N2000 à modifier)."]
[]
[]
[null,null,null,null,null,"Totaux",null,null,null,null,null,null,null,null,"Total annuel"]
["Année",null,null,null,null,{"$f":"SUM(F9:F502)","v":106.5},{"$f":"SUM(G9:G502)","v":3228},1387,1090.5,920.5,724,588.5,499,3984,{"$f":"SUM(F6:N6)","v":12528}]
[null,null,null,null,null,"Inférieur à","5.01<=","10.01<=","15.01<=","20.01<=","25.01<=","30.01<=","35.01<=","Supérieur à"]
["Nom Zone","Moyenne","Ecart Type","Min","Max",5.01,"10.01>","15.01>","20.01>","25.01>","30.01>","35.01>","40.01>",40.01,"Temps hors confort"]
["FLOOR0:ZONE1",34.35,30.34,5,100,25,866.5,358.5,252.5,189.5,152,113.5,113,1061.5,{"$f":"SUM(I9:N9)","v":1882}]
["FLOOR0:ZONE2",34.06,29.2,5,99.99,26.5,780.5,317,278.5,240,189,166.5,128.5,1005.5,{"$f":"SUM(I10:N10)","v":2008}]
["FLOOR1:SANITAIRES",33.450000000000003,29.35,5,99.99,26,800,375,273.5,234,176,149.5,127,971,1931]
["FLOOR1:ZONE1",32.99,28.43,5,100,29,781,336.5,286,257,207,159,130.5,946,1985.5]
[null,null,null,null,null,null,null,null,null,null,null,null,null,null,0]
[null,null,null,null,null,null,null,null,null,null,null,null,null,null,0]
[null,null,null,null,null,null,null,null,null,null,null,null,null,null,0]
{"$rows_left_out":39}
{"sheet":"Tableau BREEAM","index":4,"n_rows":32,"n_cols":10,"rows_kept":32,"cut":false,"hidden":false,"merged":[]}
[]
[]
[null,"Space","PMV min","PMV max","PPD min","PPD max","Mean PPD","% of unmet hours"]
[null,{"$f":"'Resultats PMV'!A9","v":"FLOOR0:ZONE1"},{"$f":"'Resultats PMV'!D9","v":-2.2000000000000002},{"$f":"'Resultats PMV'!E9","v":4.3899999999999997},{"$f":"VLOOKUP($B4,'Resultats PPD'!$A$9:$D$53,4,FALSE)","v":5},{"$f":"VLOOKUP($B4,'Resultats PPD'!$A$9:$E$53,5,FALSE)","v":100},null,{"$f":"VLOOKUP($B4,'Synth & graphe PMV'!$B$19:$M$104,12,FALSE)","v":0.70849297573435499},null,{"$f":"MAX(ABS(C4),D4)","v":4.3899999999999997}]
[null,{"$f":"'Resultats PMV'!A10","v":"FLOOR0:ZONE2"},{"$f":"'Resultats PMV'!D10","v":-2.2999999999999998},{"$f":"'Resultats PMV'!E10","v":3.77},{"$f":"VLOOKUP($B5,'Resultats PPD'!$A$9:$D$53,4,FALSE)","v":5},{"$f":"VLOOKUP($B5,'Resultats PPD'!$A$9:$E$53,5,FALSE)","v":99.99},null,{"$f":"VLOOKUP($B5,'Synth & graphe PMV'!$B$19:$M$104,12,FALSE)","v":0.73802681992337171},null,{"$f":"MAX(ABS(C5),D5)","v":3.77}]
[null,{"$f":"'Resultats PMV'!A11","v":"FLOOR1:SANITAIRES"},{"$f":"'Resultats PMV'!D11","v":-2},{"$f":"'Resultats PMV'!E11","v":3.67},{"$f":"VLOOKUP($B6,'Resultats PPD'!$A$9:$D$53,4,FALSE)","v":5},{"$f":"VLOOKUP($B6,'Resultats PPD'!$A$9:$E$53,5,FALSE)","v":99.99},null,{"$f":"VLOOKUP($B6,'Synth & graphe PMV'!$B$19:$M$104,12,FALSE)","v":0.72940613026819923},null,3.67]
[null,{"$f":"'Resultats PMV'!A12","v":"FLOOR1:ZONE1"},{"$f":"'Resultats PMV'!D12","v":-2.2000000000000002},{"$f":"'Resultats PMV'!E12","v":3.91},{"$f":"VLOOKUP($B7,'Resultats PPD'!$A$9:$D$53,4,FALSE)","v":5},{"$f":"VLOOKUP($B7,'Resultats PPD'!$A$9:$E$53,5,FALSE)","v":100},null,{"$f":"VLOOKUP($B7,'Synth & graphe PMV'!$B$19:$M$104,12,FALSE)","v":0.73547254150702424},null,3.91]
[null,{"$f":"'Resultats PMV'!A13","v":0},{"$f":"'Resultats PMV'!D13","v":0},{"$f":"'Resultats PMV'!E13","v":0},{"$f":"VLOOKUP($B8,'Resultats PPD'!$A$9:$D$53,4,FALSE)","v":{"$error":"#N/A"}},{"$f":"VLOOKUP($B8,'Resultats PPD'!$A$9:$E$53,5,FALSE)","v":{"$error":"#N/A"}},null,{"$f":"VLOOKUP($B8,'Synth & graphe PMV'!$B$19:$M$104,12,FALSE)","v":{"$error":"#DIV/0!"}},null,0]
[null,{"$f":"'Resultats PMV'!A14","v":0},{"$f":"'Resultats PMV'!D14","v":0},{"$f":"'Resultats PMV'!E14","v":0},{"$f":"VLOOKUP($B9,'Resultats PPD'!$A$9:$D$53,4,FALSE)","v":{"$error":"#N/A"}},{"$f":"VLOOKUP($B9,'Resultats PPD'!$A$9:$E$53,5,FALSE)","v":{"$error":"#N/A"}},null,{"$f":"VLOOKUP($B9,'Synth & graphe PMV'!$B$19:$M$104,12,FALSE)","v":{"$error":"#DIV/0!"}},null,0]
[null,{"$f":"'Resultats PMV'!A15","v":0},{"$f":"'Resultats PMV'!D15","v":0},{"$f":"'Resultats PMV'!E15","v":0},{"$f":"VLOOKUP($B10,'Resultats PPD'!$A$9:$D$53,4,FALSE)","v":{"$error":"#N/A"}},{"$f":"VLOOKUP($B10,'Resultats PPD'!$A$9:$E$53,5,FALSE)","v":{"$error":"#N/A"}},null,{"$f":"VLOOKUP($B10,'Synth & graphe PMV'!$B$19:$M$104,12,FALSE)","v":{"$error":"#DIV/0!"}},null,0]
[null,{"$f":"'Resultats PMV'!A16","v":0},{"$f":"'Resultats PMV'!D16","v":0},{"$f":"'Resultats PMV'!E16","v":0},{"$f":"VLOOKUP($B11,'Resultats PPD'!$A$9:$D$53,4,FALSE)","v":{"$error":"#N/A"}},{"$f":"VLOOKUP($B11,'Resultats PPD'!$A$9:$E$53,5,FALSE)","v":{"$error":"#N/A"}},null,{"$f":"VLOOKUP($B11,'Synth & graphe PMV'!$B$19:$M$104,12,FALSE)","v":{"$error":"#DIV/0!"}},null,0]
[null,{"$f":"'Resultats PMV'!A17","v":0},{"$f":"'Resultats PMV'!D17","v":0},{"$f":"'Resultats PMV'!E17","v":0},{"$f":"VLOOKUP($B12,'Resultats PPD'!$A$9:$D$53,4,FALSE)","v":{"$error":"#N/A"}},{"$f":"VLOOKUP($B12,'Resultats PPD'!$A$9:$E$53,5,FALSE)","v":{"$error":"#N/A"}},null,{"$f":"VLOOKUP($B12,'Synth & graphe PMV'!$B$19:$M$104,12,FALSE)","v":{"$error":"#DIV/0!"}},null,0]
[null,{"$f":"'Resultats PMV'!A18","v":0},{"$f":"'Resultats PMV'!D18","v":0},{"$f":"'Resultats PMV'!E18","v":0},{"$f":"VLOOKUP($B13,'Resultats PPD'!$A$9:$D$53,4,FALSE)","v":{"$error":"#N/A"}},{"$f":"VLOOKUP($B13,'Resultats PPD'!$A$9:$E$53,5,FALSE)","v":{"$error":"#N/A"}},null,{"$f":"VLOOKUP($B13,'Synth & graphe PMV'!$B$19:$M$104,12,FALSE)","v":{"$error":"#DIV/0!"}},null,0]
[null,{"$f":"'Resultats PMV'!A19","v":0},{"$f":"'Resultats PMV'!D19","v":0},{"$f":"'Resultats PMV'!E19","v":0},{"$f":"VLOOKUP($B14,'Resultats PPD'!$A$9:$D$53,4,FALSE)","v":{"$error":"#N/A"}},{"$f":"VLOOKUP($B14,'Resultats PPD'!$A$9:$E$53,5,FALSE)","v":{"$error":"#N/A"}},null,{"$f":"VLOOKUP($B14,'Synth & graphe PMV'!$B$19:$M$104,12,FALSE)","v":{"$error":"#DIV/0!"}},null,0]
[null,{"$f":"'Resultats PMV'!A20","v":0},{"$f":"'Resultats PMV'!D20","v":0},{"$f":"'Resultats PMV'!E20","v":0},{"$f":"VLOOKUP($B15,'Resultats PPD'!$A$9:$D$53,4,FALSE)","v":{"$error":"#N/A"}},{"$f":"VLOOKUP($B15,'Resultats PPD'!$A$9:$E$53,5,FALSE)","v":{"$error":"#N/A"}},null,{"$f":"VLOOKUP($B15,'Synth & graphe PMV'!$B$19:$M$104,12,FALSE)","v":{"$error":"#DIV/0!"}},null,0]
{"$rows_left_out":17}